search cancel

Impossible to deploy per SMP/E ZOS Agent with devbuild 21.0.4 and 12.3.9.-- RETURN CODE WAS 12

book

Article ID: 256526

calendar_today

Updated On:

Products

CA Automic One Automation

Issue/Introduction

Z/OS agent deployment via SMP/E deployment failsfor the two build 12.3.9 and 21.0.4

 

For the 21.0.4 Devbuild 1660267617987

 

SMP/E Deployment fails on binary UCXJM25

 

=============================================================

GIM69010E ** AN ERROR OCCURRED IN RETRANSFORMATION OF PROGRAM UCXJM25 ON THE SYSUT1 LIBRARY. DATA HAS BEEN LOST.

GIM69011I    RETRANSFORMATION OF PROGRAM UCXJM25 ON LIBRARY SYSUT1 WAS UNSUCCESSFUL FOR SYSMOD HAUT000.

GIM30217I    APPLY PROCESSING FAILED FOR SYSMOD HAUT000. RETRANSFORMATION PROCESSING FAILED FOR AN ELEMENT IN HAUT000.

GIM37001S ** APPLY PROCESSING STOPPED BECAUSE FUNCTION SYSMOD HAUT000 FAILED.

GIM20501I    APPLY PROCESSING IS COMPLETE. THE HIGHEST RETURN CODE WAS 12.

=============================================================

For the Z/OS Agent build 12.3.9 build 1654840413338

SMP/E Deployment fails on Call API module UCCALL4I

=============================================================

GIM69010E ** AN ERROR OCCURRED IN RETRANSFORMATION OF PROGRAM UCCALL4I ON THE SYSUT1 LIBRARY. DATA HAS BEEN LOST.

GIM69011I    RETRANSFORMATION OF PROGRAM UCCALL4I ON LIBRARY SYSUT1 WAS UNSUCCESSFUL FOR SYSMOD HAUT000.

GIM30217I    APPLY PROCESSING FAILED FOR SYSMOD HAUT000. RETRANSFORMATION PROCESSING FAILED FOR AN ELEMENT IN HAUT000.

GIM37001S ** APPLY PROCESSING STOPPED BECAUSE FUNCTION SYSMOD HAUT000 FAILED.   

GIM20501I    APPLY PROCESSING IS COMPLETE. THE HIGHEST RETURN CODE WAS 12.      

 GIM20502I    SMP/E PROCESSING IS COMPLETE. THE HIGHEST RETURN CODE WAS 12. SMP/E IS AT LEVEL 37.12.

================================================================================================

Deployment of Agent 12.3.8 runs without a problem, so the problem does not come from the SMPE settings on the host.

 

Environment

Z/OS Agent in Release : 12.3.9 and 21.0.4

Cause

This is a defect introduced in version 12.3.9 and 21.0.4 of the Z/OS Agent

Resolution

This bug is fixed in the following versions of the Z/OS agent:

12.3.9 HF2 -- available

21.0.4 HF1 -- available

21.0.5 -- planned to be available end of February 2023

Resolution : A problem has been solved where z/OS Agent SMP/E installation fails due to invalid date format in REWORK parameter.