search cancel

Error 19033 installing CABI 7.1.1 on windows

book

Article ID: 253449

calendar_today

Updated On:

Products

CA Service Operations Insight (SOI)

Issue/Introduction

Running this install using ‘run as administrator’ option.

Install fails every time.

Check %temp% for logs which may not have written to logs folder:

C:\Users\USER-NAME\AppData\Local\Temp

We see this error:

2022-10-25 12:26:08 INFO  JasperInstaller:201 - Running install-minimal-pro Ant task

2022-10-25 12:26:08 INFO  JasperInstaller:201 - ----------------------------------------------------------------------

2022-10-25 12:26:09 INFO  JasperInstaller:201 - Buildfile: D:\unicabi-7.1.1\buildomatic\build.xml

2022-10-25 12:26:10 INFO  JasperInstaller:201 -      [echo] Filtering properties (cleaning out blank spaces)

2022-10-25 12:26:11 INFO  JasperInstaller:201 - [create-ks] java.lang.RuntimeException: java.lang.Exception: Keystore may have been tempered with.

2022-10-25 12:26:11 INFO  JasperInstaller:201 -

2022-10-25 12:26:11 INFO  JasperInstaller:205 - BUILD FAILED

2022-10-25 12:26:11 ERROR CABIUtil:109 - ErrorCode : 19033   ErrorMessage :

Environment

Release : 4.2 CU4

CABI jaspersoft for windows 7.1.1

Cause

SOI CABI installs as the user running the install, and it run by the same user.

Due to this, CABI places some needed files in the user’s home directory:

These may include:

Hidden folder

 .jasperserver

Hidden files

 .jrsks

 .jrsksp

 .jslic

Regular file

Jasperserver.license

..

..

Resolution

There were jaspersoft files left in the user’s home directory, either from failed installs, or older installs that had been removed.

These may include:

Hidden folder

 .jasperserver

Hidden files

 .jrsks

 .jrsksp

 .jslic

Regular file

Jasperserver.license

** Delete all jaspersoft files from the user’s home directory and re-run the install

Additional Information

The jaspersoft error ErrorCode : 19033 is a generic error that is used when there is no specific code for the problem seen, and may be misleading.

 

Identity_Manager_CABI_Install_Fails

 

Attachments